Target
Protein LANA1
Ligand
BDBM74336
Substrate
Meas. Tech.
Fluorescence Polarization Cell-Free Homogeneous Dose Retest to Confirm Inhibitors of the LANA Histone H2A/H2B Interaction
EC50
>75000±n/a nM
Citation
 PubChem, PC Fluorescence Polarization Cell-Free Homogeneous Dose Retest to Confirm Inhibitors of the LANA Histone H2A/H2B Interaction PubChem Bioassay (2010)[AID] 
Target
Name:
Protein LANA1
Synonyms:
LANA LANA1_HHV8P
Type:
Enzyme Catalytic Domain
Mol. Mass.:
131093.36
Organism:
Human herpesvirus 8
Description:
Q9QR71
Residue:
1129
  
Inhibitor
Name:
BDBM74336
Synonyms:
1-(4-morpholino-3-nitro-benzoyl)isonipecotic acid ethyl ester MLS002163677 cid_4807772 ethyl 1-(4-morpholin-4-yl-3-nitrobenzoyl)piperidine-4-carboxylate
Type:
Small organic molecule
Emp. Form.:
C19H25N3O6
Mol. Mass.:
391.4183
SMILES:
CCOC(=O)C1CCN(CC1)C(=O)c1ccc(N2CCOCC2)c(c1)[N+]([O-])=O
: