Target
Tyrosine-protein phosphatase non-receptor type 22
Ligand
BDBM59258
Substrate
Meas. Tech.
Dose Response confirmation of uHTS hits from a small molecule inhibitors of LYP via a fluorescence intensity assay - Set 2
IC50
>79400±0 nM
Citation
 PubChem, PC Dose Response confirmation of uHTS hits from a small molecule inhibitors of LYP via a fluorescence intensity assay - Set 2 PubChem Bioassay (2010)[AID] 
Target
Name:
Tyrosine-protein phosphatase non-receptor type 22
Synonyms:
3.1.3.48 LyP Lymphoid phosphatase (Lyp) PEST-domain phosphatase PTPN22 Tyrosine-protein phosphatase non-receptor type 22 (LYP) | tyrosine-protein phosphatase non-receptor type 22 isoform 1
Type:
Mol. Mass.:
91712.31
Organism:
Homo sapiens (Human)
Description:
Q9Y2R2
Residue:
807
  
Inhibitor
Name:
BDBM59258
Synonyms:
(5E)-5-(6-ketocyclohexa-2,4-dien-1-ylidene)-N-p-anisyl-3-pyrazoline-3-carboxamide (5E)-N-[(4-methoxyphenyl)methyl]-5-(6-oxo-1-cyclohexa-2,4-dienylidene)-1,2-dihydropyrazole-3-carboxamide MLS000084094 cid_5389985
Type:
Small organic molecule
Emp. Form.:
C18H17N3O3
Mol. Mass.:
323.3459
SMILES:
COc1ccc(CNC(=O)c2cc(n[nH]2)-c2ccccc2O)cc1
: