Target
Tyrosine-protein phosphatase non-receptor type 22
Ligand
BDBM74455
Substrate
Meas. Tech.
Dose Response confirmation of uHTS hits from a small molecule inhibitors of LYP via a fluorescence intensity assay - Set 2
IC50
>79400±0 nM
Citation
 PubChem, PC Dose Response confirmation of uHTS hits from a small molecule inhibitors of LYP via a fluorescence intensity assay - Set 2 PubChem Bioassay (2010)[AID] 
Target
Name:
Tyrosine-protein phosphatase non-receptor type 22
Synonyms:
3.1.3.48 LyP Lymphoid phosphatase (Lyp) PEST-domain phosphatase PTPN22 Tyrosine-protein phosphatase non-receptor type 22 (LYP) | tyrosine-protein phosphatase non-receptor type 22 isoform 1
Type:
Mol. Mass.:
91712.31
Organism:
Homo sapiens (Human)
Description:
Q9Y2R2
Residue:
807
  
Inhibitor
Name:
BDBM74455
Synonyms:
MLS000046764 N-[3-(2-ethylpiperidin-1-yl)propyl]-5-[(2-fluorophenyl)methylsulfonylmethyl]furan-2-carboxamide N-[3-(2-ethylpiperidino)propyl]-5-[(2-fluorobenzyl)sulfonylmethyl]-2-furamide cid_3240388
Type:
Small organic molecule
Emp. Form.:
C23H31FN2O4S
Mol. Mass.:
450.567
SMILES:
CCC1CCCCN1CCCNC(=O)c1ccc(CS(=O)(=O)Cc2ccccc2F)o1
: