Target
Tyrosine-protein phosphatase non-receptor type 22
Ligand
BDBM74458
Substrate
Meas. Tech.
Dose Response confirmation of uHTS hits from a small molecule inhibitors of LYP via a fluorescence intensity assay - Set 2
IC50
>79400±0 nM
Citation
 PubChem, PC Dose Response confirmation of uHTS hits from a small molecule inhibitors of LYP via a fluorescence intensity assay - Set 2 PubChem Bioassay (2010)[AID] 
Target
Name:
Tyrosine-protein phosphatase non-receptor type 22
Synonyms:
3.1.3.48 LyP Lymphoid phosphatase (Lyp) PEST-domain phosphatase PTPN22 Tyrosine-protein phosphatase non-receptor type 22 (LYP) | tyrosine-protein phosphatase non-receptor type 22 isoform 1
Type:
Mol. Mass.:
91712.31
Organism:
Homo sapiens (Human)
Description:
Q9Y2R2
Residue:
807
  
Inhibitor
Name:
BDBM74458
Synonyms:
1-(2,6-dimethyl-4-morpholinyl)-2-(4-methoxyphenoxy)-1-propanone 1-(2,6-dimethylmorpholino)-2-(4-methoxyphenoxy)propan-1-one MLS000066438 cid_2974424
Type:
Small organic molecule
Emp. Form.:
C16H23NO4
Mol. Mass.:
293.3581
SMILES:
COc1ccc(OC(C)C(=O)N2CC(C)OC(C)C2)cc1
: