Target
Tyrosine-protein phosphatase non-receptor type 22
Ligand
BDBM74469
Substrate
Meas. Tech.
Dose Response confirmation of uHTS hits from a small molecule inhibitors of LYP via a fluorescence intensity assay - Set 2
IC50
>79400±0 nM
Citation
 PubChem, PC Dose Response confirmation of uHTS hits from a small molecule inhibitors of LYP via a fluorescence intensity assay - Set 2 PubChem Bioassay (2010)[AID] 
Target
Name:
Tyrosine-protein phosphatase non-receptor type 22
Synonyms:
3.1.3.48 LyP Lymphoid phosphatase (Lyp) PEST-domain phosphatase PTPN22 Tyrosine-protein phosphatase non-receptor type 22 (LYP) | tyrosine-protein phosphatase non-receptor type 22 isoform 1
Type:
Mol. Mass.:
91712.31
Organism:
Homo sapiens (Human)
Description:
Q9Y2R2
Residue:
807
  
Inhibitor
Name:
BDBM74469
Synonyms:
2-(5-bromanylfuran-2-yl)-2,3-dihydro-1H-perimidine 2-(5-bromo-2-furyl)-2,3-dihydro-1H-perimidine MLS000112734 cid_802594
Type:
Small organic molecule
Emp. Form.:
C15H11BrN2O
Mol. Mass.:
315.165
SMILES:
Brc1ccc(o1)C1Nc2cccc3cccc(N1)c23
: