Target
Tyrosine-protein phosphatase non-receptor type 22
Ligand
BDBM74481
Substrate
Meas. Tech.
Dose Response confirmation of uHTS hits from a small molecule inhibitors of LYP via a fluorescence intensity assay - Set 2
IC50
>79400±0 nM
Citation
 PubChem, PC Dose Response confirmation of uHTS hits from a small molecule inhibitors of LYP via a fluorescence intensity assay - Set 2 PubChem Bioassay (2010)[AID] 
Target
Name:
Tyrosine-protein phosphatase non-receptor type 22
Synonyms:
3.1.3.48 LyP Lymphoid phosphatase (Lyp) PEST-domain phosphatase PTPN22 Tyrosine-protein phosphatase non-receptor type 22 (LYP) | tyrosine-protein phosphatase non-receptor type 22 isoform 1
Type:
Mol. Mass.:
91712.31
Organism:
Homo sapiens (Human)
Description:
Q9Y2R2
Residue:
807
  
Inhibitor
Name:
BDBM74481
Synonyms:
2-chloranyl-6,7-dimethyl-quinoxaline 2-chloro-6,7-dimethylquinoxaline SMR000224742 | cid_825321
Type:
Small organic molecule
Emp. Form.:
C10H9ClN2
Mol. Mass.:
192.645
SMILES:
Cc1cc2ncc(Cl)nc2cc1C
: