Target
Tyrosine-protein phosphatase non-receptor type 22
Ligand
BDBM73670
Substrate
Meas. Tech.
Dose Response confirmation of uHTS hits from a small molecule inhibitors of LYP via a fluorescence intensity assay - Set 2
IC50
>79400±0 nM
Citation
 PubChem, PC Dose Response confirmation of uHTS hits from a small molecule inhibitors of LYP via a fluorescence intensity assay - Set 2 PubChem Bioassay (2010)[AID] 
Target
Name:
Tyrosine-protein phosphatase non-receptor type 22
Synonyms:
3.1.3.48 LyP Lymphoid phosphatase (Lyp) PEST-domain phosphatase PTPN22 Tyrosine-protein phosphatase non-receptor type 22 (LYP) | tyrosine-protein phosphatase non-receptor type 22 isoform 1
Type:
Mol. Mass.:
91712.31
Organism:
Homo sapiens (Human)
Description:
Q9Y2R2
Residue:
807
  
Inhibitor
Name:
BDBM73670
Synonyms:
2-[1-amino-2-(4-fluorophenyl)ethyl]hexanoic acid ethyl ester;hydrochloride SMR000309219 ethyl 2-[1-amino-2-(4-fluorophenyl)ethyl]hexanoate;hydrochloride | ethyl 2-[1-azanyl-2-(4-fluorophenyl)ethyl]hexanoate;hydrochloride
Type:
Small organic molecule
Emp. Form.:
C16H24FNO2
Mol. Mass.:
281.3657
SMILES:
CCCCC(C(N)Cc1ccc(F)cc1)C(=O)OCC
: