Target
Importin subunit alpha-1
Ligand
BDBM74549
Substrate
Meas. Tech.
Fluorescence Cell-Free Homogeneous Counterscreen to Identify Inhibitors of the RanGTP-Importin-beta complex.
EC50
>500000±n/a nM
Citation
 PubChem, PC Fluorescence Cell-Free Homogeneous Counterscreen to Identify Inhibitors of the RanGTP-Importin-beta complex. PubChem Bioassay (2010)[AID] 
Target
Name:
Importin subunit alpha-1
Synonyms:
IMA1_HUMAN RCH1 karyopherin alpha 2 (RAG cohort 1, importin alpha 1), isoform CRA_b
Type:
Enzyme Catalytic Domain
Mol. Mass.:
57852.15
Organism:
Homo sapiens (Human)
Description:
gi_119609447
Residue:
529
  
Inhibitor
Name:
BDBM74549
Synonyms:
MLS000033131 N-(3-fluorophenyl)-4-(2-oxolanylmethylsulfamoyl)benzamide N-(3-fluorophenyl)-4-(tetrahydrofurfurylsulfamoyl)benzamide cid_647095
Type:
Small organic molecule
Emp. Form.:
C18H19FN2O4S
Mol. Mass.:
378.418
SMILES:
Fc1cccc(NC(=O)c2ccc(cc2)S(=O)(=O)NCC2CCCO2)c1
: