Target
Importin subunit alpha-1
Ligand
BDBM74804
Substrate
Meas. Tech.
Fluorescence Cell-Free Homogeneous Counterscreen to Identify Inhibitors of the RanGTP-Importin-beta complex.
EC50
>500000±n/a nM
Citation
 PubChem, PC Fluorescence Cell-Free Homogeneous Counterscreen to Identify Inhibitors of the RanGTP-Importin-beta complex. PubChem Bioassay (2010)[AID] 
Target
Name:
Importin subunit alpha-1
Synonyms:
IMA1_HUMAN RCH1 karyopherin alpha 2 (RAG cohort 1, importin alpha 1), isoform CRA_b
Type:
Enzyme Catalytic Domain
Mol. Mass.:
57852.15
Organism:
Homo sapiens (Human)
Description:
gi_119609447
Residue:
529
  
Inhibitor
Name:
BDBM74804
Synonyms:
1-{1-[4-(4-chlorophenyl)-1,3-thiazol-2-yl]-5-hydroxy-3-methyl-1H-pyrazol-4-yl}-3-hydroxy-2-buten-1-one 2-[4-(4-chlorophenyl)-1,3-thiazol-2-yl]-5-methyl-4-[(Z)-1-oxidanyl-3-oxidanylidene-but-1-enyl]-1H-pyrazol-3-one 2-[4-(4-chlorophenyl)thiazol-2-yl]-4-[(Z)-1-hydroxy-3-keto-but-1-enyl]-5-methyl-3-pyrazolin-3-one SMR000168481 | cid_5818015
Type:
Small organic molecule
Emp. Form.:
C17H14ClN3O3S
Mol. Mass.:
375.829
SMILES:
CC(=O)CC(=O)c1c(C)[nH]n(-c2nc(cs2)-c2ccc(Cl)cc2)c1=O
: