Target
Importin subunit alpha-1
Ligand
BDBM59935
Substrate
Meas. Tech.
Fluorescence Cell-Free Homogeneous Counterscreen to Identify Inhibitors of the RanGTP-Importin-beta complex.
EC50
5730±n/a nM
Citation
 PubChem, PC Fluorescence Cell-Free Homogeneous Counterscreen to Identify Inhibitors of the RanGTP-Importin-beta complex. PubChem Bioassay (2010)[AID] 
Target
Name:
Importin subunit alpha-1
Synonyms:
IMA1_HUMAN RCH1 karyopherin alpha 2 (RAG cohort 1, importin alpha 1), isoform CRA_b
Type:
Enzyme Catalytic Domain
Mol. Mass.:
57852.15
Organism:
Homo sapiens (Human)
Description:
gi_119609447
Residue:
529
  
Inhibitor
Name:
BDBM59935
Synonyms:
(E)-2-(Morpholine-4-carbonyl)-3-(5-morpholin-4-yl-furan-2-yl)-acrylonitrile (E)-2-(morpholine-4-carbonyl)-3-(5-morpholino-2-furyl)acrylonitrile (E)-3-[5-(4-morpholinyl)-2-furanyl]-2-[4-morpholinyl(oxo)methyl]-2-propenenitrile SMR000219435 | cid_839237
Type:
Small organic molecule
Emp. Form.:
C16H19N3O4
Mol. Mass.:
317.3398
SMILES:
O=C(N1CCOCC1)C(=C\c1ccc(o1)N1CCOCC1)\C#N
: