Target
Importin subunit alpha-1
Ligand
BDBM74970
Substrate
Meas. Tech.
Fluorescence Cell-Free Homogeneous Counterscreen to Identify Inhibitors of the RanGTP-Importin-beta complex.
EC50
>500000±n/a nM
Citation
 PubChem, PC Fluorescence Cell-Free Homogeneous Counterscreen to Identify Inhibitors of the RanGTP-Importin-beta complex. PubChem Bioassay (2010)[AID] 
Target
Name:
Importin subunit alpha-1
Synonyms:
IMA1_HUMAN RCH1 karyopherin alpha 2 (RAG cohort 1, importin alpha 1), isoform CRA_b
Type:
Enzyme Catalytic Domain
Mol. Mass.:
57852.15
Organism:
Homo sapiens (Human)
Description:
gi_119609447
Residue:
529
  
Inhibitor
Name:
BDBM74970
Synonyms:
1,3-benzothiazol-2-yl-[3-(2-morpholinoethyl)-2,4-dihydro-1H-s-triazin-6-yl]amine N-[3-(2-morpholin-4-ylethyl)-2,4-dihydro-1H-1,3,5-triazin-6-yl]-1,3-benzothiazol-2-amine SMR000287401 | cid_943211
Type:
Small organic molecule
Emp. Form.:
C16H22N6OS
Mol. Mass.:
346.45
SMILES:
C(CN1CNC(Nc2nc3ccccc3s2)=NC1)N1CCOCC1
: