Target
Importin subunit alpha-1
Ligand
BDBM75285
Substrate
Meas. Tech.
Fluorescence Cell-Free Homogeneous Counterscreen to Identify Inhibitors of the RanGTP-Importin-beta complex.
EC50
720.5±n/a nM
Citation
 PubChem, PC Fluorescence Cell-Free Homogeneous Counterscreen to Identify Inhibitors of the RanGTP-Importin-beta complex. PubChem Bioassay (2010)[AID] 
Target
Name:
Importin subunit alpha-1
Synonyms:
IMA1_HUMAN RCH1 karyopherin alpha 2 (RAG cohort 1, importin alpha 1), isoform CRA_b
Type:
Enzyme Catalytic Domain
Mol. Mass.:
57852.15
Organism:
Homo sapiens (Human)
Description:
gi_119609447
Residue:
529
  
Inhibitor
Name:
BDBM75285
Synonyms:
3-[2-(2-methoxyphenyl)ethynyl]-10-methyl-9-acridinone 3-[2-(2-methoxyphenyl)ethynyl]-10-methylacridin-9-one SMR000685998 | cid_24818828
Type:
Small organic molecule
Emp. Form.:
C23H17NO2
Mol. Mass.:
339.3866
SMILES:
COc1ccccc1C#Cc1ccc2c(c1)n(C)c1ccccc1c2=O
: