Target
Tyrosine-protein phosphatase non-receptor type 22
Ligand
BDBM74473
Substrate
Meas. Tech.
Dose Response confirmation of uHTS hits from a small molecule inhibitors of LYP via a fluorescence intensity assay using pCAP substrate
IC50
>79400±n/a nM
Citation
 PubChem, PC Dose Response confirmation of uHTS hits from a small molecule inhibitors of LYP via a fluorescence intensity assay using pCAP substrate PubChem Bioassay (2010)[AID] 
Target
Name:
Tyrosine-protein phosphatase non-receptor type 22
Synonyms:
3.1.3.48 LyP Lymphoid phosphatase (Lyp) PEST-domain phosphatase PTPN22 Tyrosine-protein phosphatase non-receptor type 22 (LYP) | tyrosine-protein phosphatase non-receptor type 22 isoform 1
Type:
Mol. Mass.:
91712.31
Organism:
Homo sapiens (Human)
Description:
Q9Y2R2
Residue:
807
  
Inhibitor
Name:
BDBM74473
Synonyms:
MLS000549501 N-(1-adamantyl)-3-[(4-bromo-3,5-dimethyl-1-pyrazolyl)methyl]benzamide N-(1-adamantyl)-3-[(4-bromo-3,5-dimethyl-pyrazol-1-yl)methyl]benzamide SMR000114783 | cid_4287298
Type:
Small organic molecule
Emp. Form.:
C23H28BrN3O
Mol. Mass.:
442.392
SMILES:
[H]C12CC3([H])CC([H])(C1)CC(C2)(C3)NC(=O)c1cccc(Cn2nc(C)c(Br)c2C)c1
: