Target
Tyrosine-protein phosphatase non-receptor type 22
Ligand
BDBM74509
Substrate
Meas. Tech.
Dose Response confirmation of uHTS hits from a small molecule inhibitors of LYP via a fluorescence intensity assay using pCAP substrate
IC50
>79400±n/a nM
Citation
 PubChem, PC Dose Response confirmation of uHTS hits from a small molecule inhibitors of LYP via a fluorescence intensity assay using pCAP substrate PubChem Bioassay (2010)[AID] 
Target
Name:
Tyrosine-protein phosphatase non-receptor type 22
Synonyms:
3.1.3.48 LyP Lymphoid phosphatase (Lyp) PEST-domain phosphatase PTPN22 Tyrosine-protein phosphatase non-receptor type 22 (LYP) | tyrosine-protein phosphatase non-receptor type 22 isoform 1
Type:
Mol. Mass.:
91712.31
Organism:
Homo sapiens (Human)
Description:
Q9Y2R2
Residue:
807
  
Inhibitor
Name:
BDBM74509
Synonyms:
2-ethyl-5,6-dinitro-1H-benzimidazole SMR000224880 | cid_5104602
Type:
Small organic molecule
Emp. Form.:
C9H8N4O4
Mol. Mass.:
236.1842
SMILES:
CCc1nc2cc(c(cc2[nH]1)[N+]([O-])=O)[N+]([O-])=O
: