Target
Tyrosine-protein phosphatase non-receptor type 22
Ligand
BDBM74529
Substrate
Meas. Tech.
Dose Response confirmation of uHTS hits from a small molecule inhibitors of LYP via a fluorescence intensity assay using pCAP substrate
IC50
>79400±n/a nM
Citation
 PubChem, PC Dose Response confirmation of uHTS hits from a small molecule inhibitors of LYP via a fluorescence intensity assay using pCAP substrate PubChem Bioassay (2010)[AID] 
Target
Name:
Tyrosine-protein phosphatase non-receptor type 22
Synonyms:
3.1.3.48 LyP Lymphoid phosphatase (Lyp) PEST-domain phosphatase PTPN22 Tyrosine-protein phosphatase non-receptor type 22 (LYP) | tyrosine-protein phosphatase non-receptor type 22 isoform 1
Type:
Mol. Mass.:
91712.31
Organism:
Homo sapiens (Human)
Description:
Q9Y2R2
Residue:
807
  
Inhibitor
Name:
BDBM74529
Synonyms:
2-(2-methyl-2,3-dihydroindol-1-yl)-N-(3-sulfamoylphenyl)acetamide 2-(2-methylindolin-1-yl)-N-(3-sulfamoylphenyl)acetamide SMR000365029 | cid_4364151
Type:
Small organic molecule
Emp. Form.:
C17H19N3O3S
Mol. Mass.:
345.416
SMILES:
CC1Cc2ccccc2N1CC(=O)Nc1cccc(c1)S(N)(=O)=O
: