Target
Tyrosine-protein phosphatase non-receptor type 22
Ligand
BDBM74532
Substrate
Meas. Tech.
Dose Response confirmation of uHTS hits from a small molecule inhibitors of LYP via a fluorescence intensity assay using pCAP substrate
IC50
>79400±n/a nM
Citation
 PubChem, PC Dose Response confirmation of uHTS hits from a small molecule inhibitors of LYP via a fluorescence intensity assay using pCAP substrate PubChem Bioassay (2010)[AID] 
Target
Name:
Tyrosine-protein phosphatase non-receptor type 22
Synonyms:
3.1.3.48 LyP Lymphoid phosphatase (Lyp) PEST-domain phosphatase PTPN22 Tyrosine-protein phosphatase non-receptor type 22 (LYP) | tyrosine-protein phosphatase non-receptor type 22 isoform 1
Type:
Mol. Mass.:
91712.31
Organism:
Homo sapiens (Human)
Description:
Q9Y2R2
Residue:
807
  
Inhibitor
Name:
BDBM74532
Synonyms:
4-[3-(3,4-dimethoxyphenyl)-5-(4-methylphenyl)-3,4-dihydropyrazol-2-yl]-4-oxidanylidene-butanoic acid 4-[5-(3,4-Dimethoxy-phenyl)-3-p-tolyl-4,5-dihydro-pyrazol-1-yl]-4-oxo-butyric acid MLS001211891 cid_3132765
Type:
Small organic molecule
Emp. Form.:
C22H24N2O5
Mol. Mass.:
396.4364
SMILES:
COc1ccc(cc1OC)C1CC(=NN1C(=O)CCC(O)=O)c1ccc(C)cc1
: