Target
Tyrosine-protein phosphatase non-receptor type 22
Ligand
BDBM74533
Substrate
Meas. Tech.
Dose Response confirmation of uHTS hits from a small molecule inhibitors of LYP via a fluorescence intensity assay using pCAP substrate
IC50
>79400±n/a nM
Citation
 PubChem, PC Dose Response confirmation of uHTS hits from a small molecule inhibitors of LYP via a fluorescence intensity assay using pCAP substrate PubChem Bioassay (2010)[AID] 
Target
Name:
Tyrosine-protein phosphatase non-receptor type 22
Synonyms:
3.1.3.48 LyP Lymphoid phosphatase (Lyp) PEST-domain phosphatase PTPN22 Tyrosine-protein phosphatase non-receptor type 22 (LYP) | tyrosine-protein phosphatase non-receptor type 22 isoform 1
Type:
Mol. Mass.:
91712.31
Organism:
Homo sapiens (Human)
Description:
Q9Y2R2
Residue:
807
  
Inhibitor
Name:
BDBM74533
Synonyms:
MLS001196945 N-(4-chloro-3-oxazolo[4,5-b]pyridin-2-yl-phenyl)butyramide N-[4-chloro-3-(2-oxazolo[4,5-b]pyridinyl)phenyl]butanamide SMR000555825 | cid_718618
Type:
Small organic molecule
Emp. Form.:
C16H14ClN3O2
Mol. Mass.:
315.754
SMILES:
CCCC(=O)Nc1ccc(Cl)c(c1)-c1nc2ncccc2o1
: