Target
Tyrosine-protein phosphatase non-receptor type 22
Ligand
BDBM74541
Substrate
Meas. Tech.
Dose Response confirmation of uHTS hits from a small molecule inhibitors of LYP via a fluorescence intensity assay using pCAP substrate
IC50
>79400±n/a nM
Citation
 PubChem, PC Dose Response confirmation of uHTS hits from a small molecule inhibitors of LYP via a fluorescence intensity assay using pCAP substrate PubChem Bioassay (2010)[AID] 
Target
Name:
Tyrosine-protein phosphatase non-receptor type 22
Synonyms:
3.1.3.48 LyP Lymphoid phosphatase (Lyp) PEST-domain phosphatase PTPN22 Tyrosine-protein phosphatase non-receptor type 22 (LYP) | tyrosine-protein phosphatase non-receptor type 22 isoform 1
Type:
Mol. Mass.:
91712.31
Organism:
Homo sapiens (Human)
Description:
Q9Y2R2
Residue:
807
  
Inhibitor
Name:
BDBM74541
Synonyms:
MLS001157989 N-[4-[(3,4-dimethyl-1,2-oxazol-5-yl)sulfamoyl]phenyl]-4-oxo-1-phenylpyridazine-3-carboxamide N-[4-[(3,4-dimethylisoxazol-5-yl)sulfamoyl]phenyl]-4-keto-1-phenyl-pyridazine-3-carboxamide cid_16452711
Type:
Small organic molecule
Emp. Form.:
C22H19N5O5S
Mol. Mass.:
465.482
SMILES:
Cc1noc(NS(=O)(=O)c2ccc(NC(=O)c3nn(ccc3=O)-c3ccccc3)cc2)c1C
: