Target
Tyrosine-protein phosphatase non-receptor type 7
Ligand
BDBM74462
Substrate
Meas. Tech.
Dose Response confirmation of HTS hits from an HePTP Fluorescent Assay using OMFP substrate - Set 2
IC50
>79400±0 nM
Citation
 PubChem, PC Dose Response confirmation of HTS hits from an HePTP Fluorescent Assay using OMFP substrate - Set 2 PubChem Bioassay (2010)[AID] 
Target
Name:
Tyrosine-protein phosphatase non-receptor type 7
Synonyms:
He-PTP Hematopoietic protein-tyrosine phosphatase (HEPTP) PTPN7 Tyrosine-protein phosphatase non-receptor type 7 | Tyrosine-protein phosphatase non-receptor type 7 (HEPTP)
Type:
Protein
Mol. Mass.:
40530.79
Organism:
Homo sapiens (Human)
Description:
P35236
Residue:
360
  
Inhibitor
Name:
BDBM74462
Synonyms:
2-morpholinoethyl-(2-phenyl-4-tosyl-oxazol-5-yl)amine 4-(4-methylphenyl)sulfonyl-N-[2-(4-morpholinyl)ethyl]-2-phenyl-5-oxazolamine MLS000051119 cid_1244626
Type:
Small organic molecule
Emp. Form.:
C22H25N3O4S
Mol. Mass.:
427.517
SMILES:
Cc1ccc(cc1)S(=O)(=O)c1nc(oc1NCCN1CCOCC1)-c1ccccc1
: