Target
Tyrosine-protein phosphatase non-receptor type 7
Ligand
BDBM74487
Substrate
Meas. Tech.
Dose Response confirmation of HTS hits from an HePTP Fluorescent Assay using OMFP substrate - Set 2
IC50
>79400±0 nM
Citation
 PubChem, PC Dose Response confirmation of HTS hits from an HePTP Fluorescent Assay using OMFP substrate - Set 2 PubChem Bioassay (2010)[AID] 
Target
Name:
Tyrosine-protein phosphatase non-receptor type 7
Synonyms:
He-PTP Hematopoietic protein-tyrosine phosphatase (HEPTP) PTPN7 Tyrosine-protein phosphatase non-receptor type 7 | Tyrosine-protein phosphatase non-receptor type 7 (HEPTP)
Type:
Protein
Mol. Mass.:
40530.79
Organism:
Homo sapiens (Human)
Description:
P35236
Residue:
360
  
Inhibitor
Name:
BDBM74487
Synonyms:
2-[2-(4-chloro-2,3-dimethyl-phenoxy)ethoxy]ethyl-sec-butyl-amine;oxalic acid N-[2-[2-(4-chloranyl-2,3-dimethyl-phenoxy)ethoxy]ethyl]butan-2-amine;ethanedioic acid N-[2-[2-(4-chloro-2,3-dimethylphenoxy)ethoxy]ethyl]butan-2-amine;oxalic acid SMR000272588 | cid_2935038
Type:
Small organic molecule
Emp. Form.:
C16H26ClNO2
Mol. Mass.:
299.836
SMILES:
CCC(C)NCCOCCOc1ccc(Cl)c(C)c1C
: