Target
Tyrosine-protein phosphatase non-receptor type 7
Ligand
BDBM74496
Substrate
Meas. Tech.
Dose Response confirmation of HTS hits from an HePTP Fluorescent Assay using OMFP substrate - Set 2
IC50
>79400±0 nM
Citation
 PubChem, PC Dose Response confirmation of HTS hits from an HePTP Fluorescent Assay using OMFP substrate - Set 2 PubChem Bioassay (2010)[AID] 
Target
Name:
Tyrosine-protein phosphatase non-receptor type 7
Synonyms:
He-PTP Hematopoietic protein-tyrosine phosphatase (HEPTP) PTPN7 Tyrosine-protein phosphatase non-receptor type 7 | Tyrosine-protein phosphatase non-receptor type 7 (HEPTP)
Type:
Protein
Mol. Mass.:
40530.79
Organism:
Homo sapiens (Human)
Description:
P35236
Residue:
360
  
Inhibitor
Name:
BDBM74496
Synonyms:
2-[[4-(2,4-dimethylphenyl)-3-propoxycarbonyl-2-thienyl]carbamoyl]-7-oxabicyclo[2.2.1]heptane-3-carboxylic acid 2-[[4-(2,4-dimethylphenyl)-3-propoxycarbonylthiophen-2-yl]carbamoyl]-7-oxabicyclo[2.2.1]heptane-3-carboxylic acid 3-({[4-(2,4-dimethylphenyl)-3-(propoxycarbonyl)-2-thienyl]amino}carbonyl)-7-oxabicyclo[2.2.1]heptane-2-carboxylic acid SMR000231221 | cid_4187185
Type:
Small organic molecule
Emp. Form.:
C24H27NO6S
Mol. Mass.:
457.539
SMILES:
[H]C12CCC([H])(O1)C(C2C(O)=O)C(=O)Nc1scc(c1C(=O)OCCC)-c1ccc(C)cc1C
: