Target
Tyrosine-protein phosphatase non-receptor type 7
Ligand
BDBM74523
Substrate
Meas. Tech.
Dose Response confirmation of HTS hits from an HePTP Fluorescent Assay using OMFP substrate - Set 2
IC50
>79400±0 nM
Citation
 PubChem, PC Dose Response confirmation of HTS hits from an HePTP Fluorescent Assay using OMFP substrate - Set 2 PubChem Bioassay (2010)[AID] 
Target
Name:
Tyrosine-protein phosphatase non-receptor type 7
Synonyms:
He-PTP Hematopoietic protein-tyrosine phosphatase (HEPTP) PTPN7 Tyrosine-protein phosphatase non-receptor type 7 | Tyrosine-protein phosphatase non-receptor type 7 (HEPTP)
Type:
Protein
Mol. Mass.:
40530.79
Organism:
Homo sapiens (Human)
Description:
P35236
Residue:
360
  
Inhibitor
Name:
BDBM74523
Synonyms:
3-[4-(2,5-dimethyl-1H-pyrrol-1-yl)phenyl]-1H-pyrazole 5-[4-(2,5-dimethylpyrrol-1-yl)phenyl]-1H-pyrazole SMR000336537 | cid_1474504
Type:
Small organic molecule
Emp. Form.:
C15H15N3
Mol. Mass.:
237.2997
SMILES:
Cc1ccc(C)n1-c1ccc(cc1)-c1cc[nH]n1
: