Target
Tyrosine-protein phosphatase non-receptor type 7
Ligand
BDBM74528
Substrate
Meas. Tech.
Dose Response confirmation of HTS hits from an HePTP Fluorescent Assay using OMFP substrate - Set 2
IC50
>79400±0 nM
Citation
 PubChem, PC Dose Response confirmation of HTS hits from an HePTP Fluorescent Assay using OMFP substrate - Set 2 PubChem Bioassay (2010)[AID] 
Target
Name:
Tyrosine-protein phosphatase non-receptor type 7
Synonyms:
He-PTP Hematopoietic protein-tyrosine phosphatase (HEPTP) PTPN7 Tyrosine-protein phosphatase non-receptor type 7 | Tyrosine-protein phosphatase non-receptor type 7 (HEPTP)
Type:
Protein
Mol. Mass.:
40530.79
Organism:
Homo sapiens (Human)
Description:
P35236
Residue:
360
  
Inhibitor
Name:
BDBM74528
Synonyms:
1,5-dimethyl-4-[(2Z)-2-(2-methyl-3-indolylidene)hydrazinyl]-2-phenyl-3-pyrazolone 1,5-dimethyl-4-[(2Z)-2-(2-methylindol-3-ylidene)hydrazinyl]-2-phenylpyrazol-3-one MLS001033538 cid_7818396
Type:
Small organic molecule
Emp. Form.:
C20H19N5O
Mol. Mass.:
345.3978
SMILES:
Cc1[nH]c2ccccc2c1N=Nc1c(C)n(C)n(-c2ccccc2)c1=O
: