Target
Tyrosine-protein phosphatase non-receptor type 22
Ligand
BDBM61243
Substrate
Meas. Tech.
SAR LYP1 Fluorescent Assay using OMFP substrate for In Vitro dose response studies - Set 3
IC50
2600±n/a nM
Citation
 PubChem, PC SAR LYP1 Fluorescent Assay using OMFP substrate for In Vitro dose response studies - Set 3 PubChem Bioassay (2010)[AID] 
Target
Name:
Tyrosine-protein phosphatase non-receptor type 22
Synonyms:
3.1.3.48 LyP Lymphoid phosphatase (Lyp) PEST-domain phosphatase PTPN22 Tyrosine-protein phosphatase non-receptor type 22 (LYP) | tyrosine-protein phosphatase non-receptor type 22 isoform 1
Type:
Mol. Mass.:
91712.31
Organism:
Homo sapiens (Human)
Description:
Q9Y2R2
Residue:
807
  
Inhibitor
Name:
BDBM61243
Synonyms:
3-[[(E)-3-[4-(4-chlorobenzyl)oxy-3-methoxy-phenyl]-2-cyano-acryloyl]amino]benzoic acid 3-[[(E)-3-[4-[(4-chlorophenyl)methoxy]-3-methoxyphenyl]-2-cyano-1-oxoprop-2-enyl]amino]benzoic acid MLS001172702 cid_1516221
Type:
Small organic molecule
Emp. Form.:
C25H19ClN2O5
Mol. Mass.:
462.882
SMILES:
COc1cc(\C=C(/C#N)C(=O)Nc2cccc(c2)C(O)=O)ccc1OCc1ccc(Cl)cc1
: