Target
Tyrosine-protein phosphatase non-receptor type 7
Ligand
BDBM51783
Substrate
Meas. Tech.
SAR analysis of compounds that inhibit HePTP - Set 2
IC50
549±n/a nM
Citation
 PubChem, PC SAR analysis of compounds that inhibit HePTP - Set 2 PubChem Bioassay (2010)[AID] 
Target
Name:
Tyrosine-protein phosphatase non-receptor type 7
Synonyms:
He-PTP Hematopoietic protein-tyrosine phosphatase (HEPTP) PTPN7 Tyrosine-protein phosphatase non-receptor type 7 | Tyrosine-protein phosphatase non-receptor type 7 (HEPTP)
Type:
Protein
Mol. Mass.:
40530.79
Organism:
Homo sapiens (Human)
Description:
P35236
Residue:
360
  
Inhibitor
Name:
BDBM51783
Synonyms:
3-[(5E)-5-[1-(2-chlorobenzyl)-2-keto-indolin-3-ylidene]-4-keto-2-thioxo-thiazolidin-3-yl]propionic acid 3-[(5E)-5-[1-[(2-chlorophenyl)methyl]-2-oxo-3-indolylidene]-4-oxo-2-sulfanylidene-3-thiazolidinyl]propanoic acid MLS001173336 cid_1570081
Type:
Small organic molecule
Emp. Form.:
C21H15ClN2O4S2
Mol. Mass.:
458.938
SMILES:
OC(=O)CCN1C(=S)S\C(C1=O)=C1\C(=O)N(Cc2ccccc2Cl)c2ccccc12
: