Target
Kappa-type opioid receptor
Ligand
BDBM65827
Substrate
Meas. Tech.
SAR analysis of small molecule agonists of the kappa opioid receptor via a luminescent beta-arrestin assay - Set 3
EC50
454±n/a nM
Citation
 PubChem, PC SAR analysis of small molecule agonists of the kappa opioid receptor via a luminescent beta-arrestin assay - Set 3 PubChem Bioassay (2010)[AID] 
Target
Name:
Kappa-type opioid receptor
Synonyms:
K-OR-1 Kappa-opioid receptor (KOR) Kappa-type opioid receptor (KOR) OPIATE Kappa OPRK1 kappa opioid receptor (KOR)
Type:
G Protein-Coupled Receptor (GPCR)
Mol. Mass.:
42648.76
Organism:
Homo sapiens (Human)
Description:
P41145
Residue:
380
  
Inhibitor
Name:
BDBM65827
Synonyms:
2-[5-[(3,4-dichlorobenzyl)thio]-4-(2-thenyl)-1,2,4-triazol-3-yl]pyridine 2-[5-[(3,4-dichlorophenyl)methylthio]-4-(thiophen-2-ylmethyl)-1,2,4-triazol-3-yl]pyridine KUC103903N | cid_44601475
Type:
Small organic molecule
Emp. Form.:
C19H14Cl2N4S2
Mol. Mass.:
433.377
SMILES:
Clc1ccc(CSc2nnc(-c3ccccn3)n2Cc2cccs2)cc1Cl
: