Target
Estrogen receptor
Ligand
BDBM269372
Substrate
Meas. Tech.
ER Transcription Assay (MCF7 Cells)
pH
5.1±n/a
Temperature
310.15±n/a K
IC50
647±n/a nM
Comments
extracted
Citation
 Burks, HEDechantsreiter, MAHe, GNunez, JPeukert, SSpringer, CSun, YThomsen, NMTria, GSYu, B Benzothiophene derivatives and compositions thereof as selective estrogen receptor degraders US Patent  US10058534 Publication Date 8/28/2018 
Target
Name:
Estrogen receptor
Synonyms:
ER ESR ESR1_HUMAN Estrogen receptor Estrogen receptor (ER-alpha) Estrogen receptor alpha (ER) Nuclear receptor subfamily 3 group A member 1
Type:
Protein
Mol. Mass.:
66230.44
Organism:
Homo sapiens (Human)
Description:
P03372
Residue:
595
  
Inhibitor
Name:
BDBM269372
Synonyms:
US10058534, 26
Type:
Small organic molecule
Emp. Form.:
C24H18O5S
Mol. Mass.:
418.462
SMILES:
COc1ccc(cc1)-c1sc2cc(O)ccc2c1Oc1ccc(\C=C\C(O)=O)cc1
: