Target
Estrogen receptor
Ligand
BDBM269384
Substrate
Meas. Tech.
ER Transcription Assay (MCF7 Cells)
pH
5.1±n/a
Temperature
310.15±n/a K
IC50
152±n/a nM
Comments
extracted
Citation
 Burks, HEDechantsreiter, MAHe, GNunez, JPeukert, SSpringer, CSun, YThomsen, NMTria, GSYu, B Benzothiophene derivatives and compositions thereof as selective estrogen receptor degraders US Patent  US10058534 Publication Date 8/28/2018 
Target
Name:
Estrogen receptor
Synonyms:
ER ESR ESR1_HUMAN Estrogen receptor Estrogen receptor (ER-alpha) Estrogen receptor alpha (ER) Nuclear receptor subfamily 3 group A member 1
Type:
Protein
Mol. Mass.:
66230.44
Organism:
Homo sapiens (Human)
Description:
P03372
Residue:
595
  
Inhibitor
Name:
BDBM269384
Synonyms:
(E)-3-(4-((5,7-difluoro- 6-hydroxy-2-(4- hydroxyphenyl)benzo[b] thiophen-3- yl)oxy)phenyl)acrylic acid | US10058534, 38
Type:
Small organic molecule
Emp. Form.:
C23H14F2O5S
Mol. Mass.:
440.416
SMILES:
OC(=O)\C=C\c1ccc(Oc2c(sc3c(F)c(O)c(F)cc23)-c2ccc(O)cc2)cc1
: