Target
Estrogen receptor
Ligand
BDBM269458
Substrate
Meas. Tech.
ERalpha Degradation (MCF7 Cells)
pH
7.4±n/a
Temperature
298.15±n/a K
IC50
2.20±n/a nM
Comments
extracted
Citation
 Burks, HEDechantsreiter, MAHe, GNunez, JPeukert, SSpringer, CSun, YThomsen, NMTria, GSYu, B Benzothiophene derivatives and compositions thereof as selective estrogen receptor degraders US Patent  US10058534 Publication Date 8/28/2018 
Target
Name:
Estrogen receptor
Synonyms:
ER ESR ESR1_HUMAN Estrogen receptor Estrogen receptor (ER-alpha) Estrogen receptor alpha (ER) Nuclear receptor subfamily 3 group A member 1
Type:
Protein
Mol. Mass.:
66230.44
Organism:
Homo sapiens (Human)
Description:
P03372
Residue:
595
  
Inhibitor
Name:
BDBM269458
Synonyms:
(E)-2-(4-((6-hydroxy-2- (2- isopropylphenyl)benzo [b]thiophen-3- yl)oxy)benzylidene) butanoic acid | US10058534, 113
Type:
Small organic molecule
Emp. Form.:
C28H26O4S
Mol. Mass.:
458.569
SMILES:
CC\C(=C/c1ccc(Oc2c(sc3cc(O)ccc23)-c2ccccc2C(C)C)cc1)C(O)=O
: