Target
Integrin alpha-4
Ligand
BDBM75438
Substrate
Meas. Tech.
Dose Response of primary screening hit compounds for Identification of VLA-4 Allosteric Modulators
EC50
220±n/a nM
Citation
 PubChem, PC Dose Response of primary screening hit compounds for Identification of VLA-4 Allosteric Modulators PubChem Bioassay (2010)[AID] 
Target
Name:
Integrin alpha-4
Synonyms:
CD49 antigen-like family member D CD49d antigen ITA4_HUMAN Integrin alpha-4 Integrin alpha-IV VLA-4 integrin alpha 4 precursor | integrin alpha-4 precursor
Type:
Membrane Protein
Mol. Mass.:
114897.35
Organism:
Homo sapiens (Human)
Description:
P13612
Residue:
1032
  
Inhibitor
Name:
BDBM75438
Synonyms:
2-[4-[5-methoxy-2-(3-methoxyphenyl)-1-benzothiophen-3-yl]phenoxy]-N,N-dimethyl-ethanamine 2-[4-[5-methoxy-2-(3-methoxyphenyl)benzothiophen-3-yl]phenoxy]ethyl-dimethyl-amine SMR001397780 | cid_44202257
Type:
Small organic molecule
Emp. Form.:
C26H27NO3S
Mol. Mass.:
433.562
SMILES:
COc1cccc(c1)-c1sc2ccc(OC)cc2c1-c1ccc(OCCN(C)C)cc1
: