Target
Nuclear receptor subfamily 1 group I member 2
Ligand
BDBM75465
Substrate
Meas. Tech.
Luminescence-based counterscreen for activators of the Aryl Hydrocarbon Receptor (AHR): cell-based high throughput dose response screening assay for activators of the Pregnane X Receptor (PXR)
EC50
>116135±n/a nM
Citation
 PubChem, PC Luminescence-based counterscreen for activators of the Aryl Hydrocarbon Receptor (AHR): cell-based high throughput dose response screening assay for activators of the Pregnane X Receptor (PXR) PubChem Bioassay (2010)[AID] 
Target
Name:
Nuclear receptor subfamily 1 group I member 2
Synonyms:
NR1I2 Orphan nuclear receptor PAR1 PXR SXR nuclear receptor subfamily 1 group I member 2 isoform 1
Type:
Nuclear receptor
Mol. Mass.:
49774.77
Organism:
Homo sapiens (Human)
Description:
O75469
Residue:
434
  
Inhibitor
Name:
BDBM75465
Synonyms:
2-(3-fluorophenyl)-6,7-dimethoxy-1H-quinolin-4-one MLS000517795 cid_9547814
Type:
Small organic molecule
Emp. Form.:
C17H14FNO3
Mol. Mass.:
299.2964
SMILES:
COc1cc2nc(cc(O)c2cc1OC)-c1cccc(F)c1
: