Target
Nuclear receptor subfamily 1 group I member 2
Ligand
BDBM75486
Substrate
Meas. Tech.
Luminescence-based counterscreen for activators of the Aryl Hydrocarbon Receptor (AHR): cell-based high throughput dose response screening assay for activators of the Pregnane X Receptor (PXR)
EC50
78478±n/a nM
Citation
 PubChem, PC Luminescence-based counterscreen for activators of the Aryl Hydrocarbon Receptor (AHR): cell-based high throughput dose response screening assay for activators of the Pregnane X Receptor (PXR) PubChem Bioassay (2010)[AID] 
Target
Name:
Nuclear receptor subfamily 1 group I member 2
Synonyms:
NR1I2 Orphan nuclear receptor PAR1 PXR SXR nuclear receptor subfamily 1 group I member 2 isoform 1
Type:
Nuclear receptor
Mol. Mass.:
49774.77
Organism:
Homo sapiens (Human)
Description:
O75469
Residue:
434
  
Inhibitor
Name:
BDBM75486
Synonyms:
6-[[(4-chlorobenzylidene)amino]-ethyl-amino]-3-methyl-uracil 6-[[(4-chlorophenyl)methylideneamino]-ethylamino]-3-methyl-1H-pyrimidine-2,4-dione MLS000591319 cid_3784808
Type:
Small organic molecule
Emp. Form.:
C14H15ClN4O2
Mol. Mass.:
306.748
SMILES:
CCN(N=Cc1ccc(Cl)cc1)c1cc(=O)n(C)c(=O)[nH]1
: