Target
Nuclear receptor subfamily 1 group I member 2
Ligand
BDBM75488
Substrate
Meas. Tech.
Luminescence-based counterscreen for activators of the Aryl Hydrocarbon Receptor (AHR): cell-based high throughput dose response screening assay for activators of the Pregnane X Receptor (PXR)
EC50
16271±n/a nM
Citation
 PubChem, PC Luminescence-based counterscreen for activators of the Aryl Hydrocarbon Receptor (AHR): cell-based high throughput dose response screening assay for activators of the Pregnane X Receptor (PXR) PubChem Bioassay (2010)[AID] 
Target
Name:
Nuclear receptor subfamily 1 group I member 2
Synonyms:
NR1I2 Orphan nuclear receptor PAR1 PXR SXR nuclear receptor subfamily 1 group I member 2 isoform 1
Type:
Nuclear receptor
Mol. Mass.:
49774.77
Organism:
Homo sapiens (Human)
Description:
O75469
Residue:
434
  
Inhibitor
Name:
BDBM75488
Synonyms:
(Quinolin-8-yloxy)-acetic acid [1-(1-prop-2-ynyl-1H-indol-3-yl)-meth-(E)-ylidene]-hydrazide N-[(1-prop-2-ynyl-3-indolyl)methylideneamino]-2-(8-quinolinyloxy)acetamide N-[(1-prop-2-ynylindol-3-yl)methylideneamino]-2-quinolin-8-yloxyacetamide SMR000220642 | cid_1985994
Type:
Small organic molecule
Emp. Form.:
C23H18N4O2
Mol. Mass.:
382.4146
SMILES:
O=C(COc1cccc2cccnc12)NN=Cc1cn(CC#C)c2ccccc12
: