Target
Nuclear receptor subfamily 1 group I member 2
Ligand
BDBM75516
Substrate
Meas. Tech.
Luminescence-based counterscreen for activators of the Aryl Hydrocarbon Receptor (AHR): cell-based high throughput dose response screening assay for activators of the Pregnane X Receptor (PXR)
EC50
>116217±n/a nM
Citation
 PubChem, PC Luminescence-based counterscreen for activators of the Aryl Hydrocarbon Receptor (AHR): cell-based high throughput dose response screening assay for activators of the Pregnane X Receptor (PXR) PubChem Bioassay (2010)[AID] 
Target
Name:
Nuclear receptor subfamily 1 group I member 2
Synonyms:
NR1I2 Orphan nuclear receptor PAR1 PXR SXR nuclear receptor subfamily 1 group I member 2 isoform 1
Type:
Nuclear receptor
Mol. Mass.:
49774.77
Organism:
Homo sapiens (Human)
Description:
O75469
Residue:
434
  
Inhibitor
Name:
BDBM75516
Synonyms:
1-(5-chloranyl-1-methyl-indol-2-yl)carbonylpiperidine-4-carboxamide 1-(5-chloro-1-methylindole-2-carbonyl)piperidine-4-carboxamide MLS001183480 cid_4619062
Type:
Small organic molecule
Emp. Form.:
C16H18ClN3O2
Mol. Mass.:
319.786
SMILES:
Cn1c(cc2cc(Cl)ccc12)C(=O)N1CCC(CC1)C(N)=O
: