Target
Nuclear receptor subfamily 1 group I member 2
Ligand
BDBM75526
Substrate
Meas. Tech.
Luminescence-based counterscreen for activators of the Aryl Hydrocarbon Receptor (AHR): cell-based high throughput dose response screening assay for activators of the Pregnane X Receptor (PXR)
EC50
>116182±n/a nM
Citation
 PubChem, PC Luminescence-based counterscreen for activators of the Aryl Hydrocarbon Receptor (AHR): cell-based high throughput dose response screening assay for activators of the Pregnane X Receptor (PXR) PubChem Bioassay (2010)[AID] 
Target
Name:
Nuclear receptor subfamily 1 group I member 2
Synonyms:
NR1I2 Orphan nuclear receptor PAR1 PXR SXR nuclear receptor subfamily 1 group I member 2 isoform 1
Type:
Nuclear receptor
Mol. Mass.:
49774.77
Organism:
Homo sapiens (Human)
Description:
O75469
Residue:
434
  
Inhibitor
Name:
BDBM75526
Synonyms:
5-Bromo-naphthalene-1-carboxylic acid (4-methoxy-phenyl)-amide 5-bromo-N-(4-methoxyphenyl)-1-naphthalenecarboxamide 5-bromo-N-(4-methoxyphenyl)naphthalene-1-carboxamide SMR000515344 | cid_1106143
Type:
Small organic molecule
Emp. Form.:
C18H14BrNO2
Mol. Mass.:
356.213
SMILES:
COc1ccc(NC(=O)c2cccc3c(Br)cccc23)cc1
: