Target
Nuclear receptor subfamily 1 group I member 2
Ligand
BDBM75532
Substrate
Meas. Tech.
Luminescence-based counterscreen for activators of the Aryl Hydrocarbon Receptor (AHR): cell-based high throughput dose response screening assay for activators of the Pregnane X Receptor (PXR)
EC50
76326±n/a nM
Citation
 PubChem, PC Luminescence-based counterscreen for activators of the Aryl Hydrocarbon Receptor (AHR): cell-based high throughput dose response screening assay for activators of the Pregnane X Receptor (PXR) PubChem Bioassay (2010)[AID] 
Target
Name:
Nuclear receptor subfamily 1 group I member 2
Synonyms:
NR1I2 Orphan nuclear receptor PAR1 PXR SXR nuclear receptor subfamily 1 group I member 2 isoform 1
Type:
Nuclear receptor
Mol. Mass.:
49774.77
Organism:
Homo sapiens (Human)
Description:
O75469
Residue:
434
  
Inhibitor
Name:
BDBM75532
Synonyms:
MLS000950076 N-[3-[[[(E)-(3-methoxy-4-oxo-1-cyclohexa-2,5-dienylidene)methyl]hydrazo]-oxomethyl]phenyl]benzamide N-[3-[[[(E)-(4-keto-3-methoxy-cyclohexa-2,5-dien-1-ylidene)methyl]amino]carbamoyl]phenyl]benzamide cid_24789707
Type:
Small organic molecule
Emp. Form.:
C22H19N3O4
Mol. Mass.:
389.404
SMILES:
COc1cc(C=NNC(=O)c2cccc(NC(=O)c3ccccc3)c2)ccc1O
: