Target
Nuclear receptor subfamily 1 group I member 2
Ligand
BDBM17152
Substrate
Meas. Tech.
Luminescence-based counterscreen for activators of the Aryl Hydrocarbon Receptor (AHR): cell-based high throughput dose response screening assay for activators of the Pregnane X Receptor (PXR)
EC50
>116217±n/a nM
Citation
 PubChem, PC Luminescence-based counterscreen for activators of the Aryl Hydrocarbon Receptor (AHR): cell-based high throughput dose response screening assay for activators of the Pregnane X Receptor (PXR) PubChem Bioassay (2010)[AID] 
Target
Name:
Nuclear receptor subfamily 1 group I member 2
Synonyms:
NR1I2 Orphan nuclear receptor PAR1 PXR SXR nuclear receptor subfamily 1 group I member 2 isoform 1
Type:
Nuclear receptor
Mol. Mass.:
49774.77
Organism:
Homo sapiens (Human)
Description:
O75469
Residue:
434
  
Inhibitor
Name:
BDBM17152
Synonyms:
4-(5-{[(5Z)-2,4-dioxo-1,3-thiazolidin-5-ylidene]methyl}furan-2-yl)benzene-1-sulfonamide thiazolidine-2,4-dione, 14
Type:
Small organic molecule
Emp. Form.:
C14H10N2O5S2
Mol. Mass.:
350.37
SMILES:
NS(=O)(=O)c1ccc(cc1)-c1ccc(\C=C2/SC(=O)NC2=O)o1
: