Target
Aryl hydrocarbon receptor
Ligand
BDBM71633
Substrate
Meas. Tech.
Luminescence-based cell-based high throughput dose response assay for activators of the Aryl Hydrocarbon Receptor (AHR)
EC50
>3395±n/a nM
Citation
 PubChem, PC Luminescence-based cell-based high throughput dose response assay for activators of the Aryl Hydrocarbon Receptor (AHR) PubChem Bioassay (2010)[AID] 
Target
Name:
Aryl hydrocarbon receptor
Synonyms:
AHR BHLHE76 aryl hydrocarbon receptor precursor
Type:
PROTEIN
Mol. Mass.:
96143.77
Organism:
Homo sapiens (Human)
Description:
ChEMBL_1503828
Residue:
848
  
Inhibitor
Name:
BDBM71633
Synonyms:
(3-Amino-8-methyl-thieno[2,3-b]quinolin-2-yl)-morpholin-4-yl-methanone (3-amino-8-methyl-thieno[2,3-b]quinolin-2-yl)-morpholino-methanone (3-azanyl-8-methyl-thieno[2,3-b]quinolin-2-yl)-morpholin-4-yl-methanone SMR000001747 | cid_648208
Type:
Small organic molecule
Emp. Form.:
C17H17N3O2S
Mol. Mass.:
327.401
SMILES:
Cc1cccc2cc3c(N)c(sc3nc12)C(=O)N1CCOCC1
: