Target
Aryl hydrocarbon receptor
Ligand
BDBM75452
Substrate
Meas. Tech.
Luminescence-based cell-based high throughput dose response assay for activators of the Aryl Hydrocarbon Receptor (AHR)
EC50
1851±n/a nM
Citation
 PubChem, PC Luminescence-based cell-based high throughput dose response assay for activators of the Aryl Hydrocarbon Receptor (AHR) PubChem Bioassay (2010)[AID] 
Target
Name:
Aryl hydrocarbon receptor
Synonyms:
AHR BHLHE76 aryl hydrocarbon receptor precursor
Type:
PROTEIN
Mol. Mass.:
96143.77
Organism:
Homo sapiens (Human)
Description:
ChEMBL_1503828
Residue:
848
  
Inhibitor
Name:
BDBM75452
Synonyms:
MLS000092095 N-(1,2-oxazol-3-yl)-5-oxo-[1,3]thiazolo[3,2-a]pyrimidine-6-carboxamide N-isoxazol-3-yl-5-keto-thiazolo[3,2-a]pyrimidine-6-carboxamide SMR000027001 | cid_3236177
Type:
Small organic molecule
Emp. Form.:
C10H6N4O3S
Mol. Mass.:
262.245
SMILES:
O=C(Nc1ccon1)c1cnc2sccn2c1=O
: