Target
Aryl hydrocarbon receptor
Ligand
BDBM75454
Substrate
Meas. Tech.
Luminescence-based cell-based high throughput dose response assay for activators of the Aryl Hydrocarbon Receptor (AHR)
EC50
2578±n/a nM
Citation
 PubChem, PC Luminescence-based cell-based high throughput dose response assay for activators of the Aryl Hydrocarbon Receptor (AHR) PubChem Bioassay (2010)[AID] 
Target
Name:
Aryl hydrocarbon receptor
Synonyms:
AHR BHLHE76 aryl hydrocarbon receptor precursor
Type:
PROTEIN
Mol. Mass.:
96143.77
Organism:
Homo sapiens (Human)
Description:
ChEMBL_1503828
Residue:
848
  
Inhibitor
Name:
BDBM75454
Synonyms:
MLS000100066 N-[3-(5-chloro-1,3-benzoxazol-2-yl)phenyl]-2-oxolanecarboxamide N-[3-(5-chloro-1,3-benzoxazol-2-yl)phenyl]tetrahydro-2-furancarboxamide SMR000081784 | cid_2976279
Type:
Small organic molecule
Emp. Form.:
C18H15ClN2O3
Mol. Mass.:
342.776
SMILES:
Clc1ccc2oc(nc2c1)-c1cccc(NC(=O)C2CCCO2)c1
: