Target
Aryl hydrocarbon receptor
Ligand
BDBM75456
Substrate
Meas. Tech.
Luminescence-based cell-based high throughput dose response assay for activators of the Aryl Hydrocarbon Receptor (AHR)
EC50
10579±n/a nM
Citation
 PubChem, PC Luminescence-based cell-based high throughput dose response assay for activators of the Aryl Hydrocarbon Receptor (AHR) PubChem Bioassay (2010)[AID] 
Target
Name:
Aryl hydrocarbon receptor
Synonyms:
AHR BHLHE76 aryl hydrocarbon receptor precursor
Type:
PROTEIN
Mol. Mass.:
96143.77
Organism:
Homo sapiens (Human)
Description:
ChEMBL_1503828
Residue:
848
  
Inhibitor
Name:
BDBM75456
Synonyms:
2-(3-acetamidophenoxy)-N-(4-fluorophenyl)acetamide 2-[3-(acetylamino)phenoxy]-N-(4-fluorophenyl)acetamide SMR000071804 | cid_897065
Type:
Small organic molecule
Emp. Form.:
C16H15FN2O3
Mol. Mass.:
302.3003
SMILES:
CC(=O)Nc1cccc(OCC(=O)Nc2ccc(F)cc2)c1
: