Target
Aryl hydrocarbon receptor
Ligand
BDBM75462
Substrate
Meas. Tech.
Luminescence-based cell-based high throughput dose response assay for activators of the Aryl Hydrocarbon Receptor (AHR)
EC50
9355±n/a nM
Citation
 PubChem, PC Luminescence-based cell-based high throughput dose response assay for activators of the Aryl Hydrocarbon Receptor (AHR) PubChem Bioassay (2010)[AID] 
Target
Name:
Aryl hydrocarbon receptor
Synonyms:
AHR BHLHE76 aryl hydrocarbon receptor precursor
Type:
PROTEIN
Mol. Mass.:
96143.77
Organism:
Homo sapiens (Human)
Description:
ChEMBL_1503828
Residue:
848
  
Inhibitor
Name:
BDBM75462
Synonyms:
2-(4,6-Dimethyl-pyrimidin-2-ylamino)-3-phenyl-3H-imidazol-4-ol 2-[(4,6-dimethylpyrimidin-2-yl)amino]-3-phenyl-imidazol-4-ol MLS000123954 cid_920218
Type:
Small organic molecule
Emp. Form.:
C15H15N5O
Mol. Mass.:
281.3125
SMILES:
Cc1cc(C)nc(Nc2ncc(O)n2-c2ccccc2)n1
: