Target
Aryl hydrocarbon receptor
Ligand
BDBM75466
Substrate
Meas. Tech.
Luminescence-based cell-based high throughput dose response assay for activators of the Aryl Hydrocarbon Receptor (AHR)
EC50
6465±n/a nM
Citation
 PubChem, PC Luminescence-based cell-based high throughput dose response assay for activators of the Aryl Hydrocarbon Receptor (AHR) PubChem Bioassay (2010)[AID] 
Target
Name:
Aryl hydrocarbon receptor
Synonyms:
AHR BHLHE76 aryl hydrocarbon receptor precursor
Type:
PROTEIN
Mol. Mass.:
96143.77
Organism:
Homo sapiens (Human)
Description:
ChEMBL_1503828
Residue:
848
  
Inhibitor
Name:
BDBM75466
Synonyms:
3-acetyl-5-methyl-N-(1,3-thiazol-2-yl)-1,2-oxazole-4-carboxamide 3-acetyl-5-methyl-N-(2-thiazolyl)-4-isoxazolecarboxamide 3-ethanoyl-5-methyl-N-(1,3-thiazol-2-yl)-1,2-oxazole-4-carboxamide SMR000125540 | cid_4219136
Type:
Small organic molecule
Emp. Form.:
C10H9N3O3S
Mol. Mass.:
251.262
SMILES:
CC(=O)c1noc(C)c1C(=O)Nc1nccs1
: