Target
Aryl hydrocarbon receptor
Ligand
BDBM75525
Substrate
Meas. Tech.
Luminescence-based cell-based high throughput dose response assay for activators of the Aryl Hydrocarbon Receptor (AHR)
EC50
814.96±n/a nM
Citation
 PubChem, PC Luminescence-based cell-based high throughput dose response assay for activators of the Aryl Hydrocarbon Receptor (AHR) PubChem Bioassay (2010)[AID] 
Target
Name:
Aryl hydrocarbon receptor
Synonyms:
AHR BHLHE76 aryl hydrocarbon receptor precursor
Type:
PROTEIN
Mol. Mass.:
96143.77
Organism:
Homo sapiens (Human)
Description:
ChEMBL_1503828
Residue:
848
  
Inhibitor
Name:
BDBM75525
Synonyms:
2-(3-Dimethylamino-propyl)-benzo[de]isoquinoline-1,3-dione 2-[3-(dimethylamino)propyl]benzo[de]isoquinoline-1,3-quinone SMR000513699 | cid_2834616
Type:
Small organic molecule
Emp. Form.:
C17H18N2O2
Mol. Mass.:
282.337
SMILES:
CN(C)CCCN1C(=O)c2cccc3cccc(C1=O)c23
: