Target
Sphingosine 1-phosphate receptor 4
Ligand
BDBM75607
Substrate
Meas. Tech.
Late-stage fluorescence dose-response cell-based assay to identify agonists of the Sphingosine 1-Phosphate Receptor 4 (S1P4): Synthesized compounds
EC50
>50000±n/a nM
Citation
 PubChem, PC Late-stage fluorescence dose-response cell-based assay to identify agonists of the Sphingosine 1-Phosphate Receptor 4 (S1P4): Synthesized compounds PubChem Bioassay (2010)[AID] 
Target
Name:
Sphingosine 1-phosphate receptor 4
Synonyms:
EDG6 S1P receptor 4 S1P4 S1PR4_HUMAN Sphingosine 1-phosphate receptor Edg-6 sphingosine-1-phosphate 4 S1P4
Type:
G Protein-Coupled Receptor (GPCR)
Mol. Mass.:
41647.39
Organism:
Homo sapiens (Human)
Description:
Residue:
384
  
Inhibitor
Name:
BDBM75607
Synonyms:
2-[2-(2,4-dichlorophenoxy)ethoxy]-6-methyl-3-pyridinecarbonitrile 2-[2-(2,4-dichlorophenoxy)ethoxy]-6-methylpyridine-3-carbonitrile CYM5957 SR-02000000309-1 | cid_44620881
Type:
Small organic molecule
Emp. Form.:
C15H12Cl2N2O2
Mol. Mass.:
323.174
SMILES:
Cc1ccc(C#N)c(OCCOc2ccc(Cl)cc2Cl)n1
: