Target
Vasopressin V1a receptor
Ligand
BDBM75551
Substrate
Meas. Tech.
Counterscreen for Oxytocin Receptor (OXTR) agonists: Fluorescence-based cell-based high throughput dose response assay to identify agonists of the vasopressin 1 receptor (V1R)
EC50
11015±n/a nM
Citation
 PubChem, PC Counterscreen for Oxytocin Receptor (OXTR) agonists: Fluorescence-based cell-based high throughput dose response assay to identify agonists of the vasopressin 1 receptor (V1R) PubChem Bioassay (2010)[AID] 
Target
Name:
Vasopressin V1a receptor
Synonyms:
AVPR V1a AVPR1A V1AR_HUMAN VASOPRESSIN V1A Vasopressin V1 receptor Vasopressin receptor
Type:
Receptor
Mol. Mass.:
46820.18
Organism:
Homo sapiens (Human)
Description:
P37288
Residue:
418
  
Inhibitor
Name:
BDBM75551
Synonyms:
4-chloranyl-2-[[(4-fluorophenyl)methylamino]methyl]phenol;hydrochloride 4-chloro-2-[[(4-fluorophenyl)methylamino]methyl]phenol;hydrochloride SMR001307039 | cid_25161470
Type:
Small organic molecule
Emp. Form.:
C14H13ClFNO
Mol. Mass.:
265.711
SMILES:
Oc1ccc(Cl)cc1CNCc1ccc(F)cc1
: