Target
Intestinal-type alkaline phosphatase
Ligand
BDBM75616
Substrate
Meas. Tech.
Dose Response concentration confirmation of uHTS hits from a small molecule activators of human intestinal alkaline phosphatase via a luminescent assay
EC50
>100000±n/a nM
Citation
 PubChem, PC Dose Response concentration confirmation of uHTS hits from a small molecule activators of human intestinal alkaline phosphatase via a luminescent assay PubChem Bioassay (2010)[AID] 
Target
Name:
Intestinal-type alkaline phosphatase
Synonyms:
ALPI Intestinal alkaline phosphatase | PPBI_HUMAN
Type:
PROTEIN
Mol. Mass.:
56804.94
Organism:
Homo sapiens (Human)
Description:
ChEMBL_1278525
Residue:
528
  
Inhibitor
Name:
BDBM75616
Synonyms:
MLS000528920 N-(2-phenylethyl)-2-(1H-1,2,4-triazol-5-ylsulfanyl)ethanamide N-Phenethyl-2-(4H-[1,2,4]triazol-3-ylsulfanyl)-acetamide SMR000121395 | cid_1083038
Type:
Small organic molecule
Emp. Form.:
C12H14N4OS
Mol. Mass.:
262.331
SMILES:
O=C(CSc1nnc[nH]1)NCCc1ccccc1
: