Target
Intestinal-type alkaline phosphatase
Ligand
BDBM75620
Substrate
Meas. Tech.
Dose Response concentration confirmation of uHTS hits from a small molecule activators of human intestinal alkaline phosphatase via a luminescent assay
EC50
25000±n/a nM
Citation
 PubChem, PC Dose Response concentration confirmation of uHTS hits from a small molecule activators of human intestinal alkaline phosphatase via a luminescent assay PubChem Bioassay (2010)[AID] 
Target
Name:
Intestinal-type alkaline phosphatase
Synonyms:
ALPI Intestinal alkaline phosphatase | PPBI_HUMAN
Type:
PROTEIN
Mol. Mass.:
56804.94
Organism:
Homo sapiens (Human)
Description:
ChEMBL_1278525
Residue:
528
  
Inhibitor
Name:
BDBM75620
Synonyms:
MLS000555680 N-(4,5-dimethyl-1,3-thiazol-2-yl)-2-[(7-methyl-[1,3]dioxolo[4,5-g]quinolin-6-yl)sulfanyl]acetamide N-(4,5-dimethyl-2-thiazolyl)-2-[(7-methyl-[1,3]dioxolo[4,5-g]quinolin-6-yl)thio]acetamide SMR000172795 | cid_1173483
Type:
Small organic molecule
Emp. Form.:
C18H17N3O3S2
Mol. Mass.:
387.476
SMILES:
Cc1nc(NC(=O)CSc2nc3cc4OCOc4cc3cc2C)sc1C
: