Target
Intestinal-type alkaline phosphatase
Ligand
BDBM75621
Substrate
Meas. Tech.
Dose Response concentration confirmation of uHTS hits from a small molecule activators of human intestinal alkaline phosphatase via a luminescent assay
EC50
9580±n/a nM
Citation
 PubChem, PC Dose Response concentration confirmation of uHTS hits from a small molecule activators of human intestinal alkaline phosphatase via a luminescent assay PubChem Bioassay (2010)[AID] 
Target
Name:
Intestinal-type alkaline phosphatase
Synonyms:
ALPI Intestinal alkaline phosphatase | PPBI_HUMAN
Type:
PROTEIN
Mol. Mass.:
56804.94
Organism:
Homo sapiens (Human)
Description:
ChEMBL_1278525
Residue:
528
  
Inhibitor
Name:
BDBM75621
Synonyms:
2-(4-keto-6-methyl-1H-pyrimidin-2-yl)-4,5,6,7-tetrahydro-1H-indazol-3-one 2-(6-methyl-4-oxidanylidene-1H-pyrimidin-2-yl)-4,5,6,7-tetrahydro-1H-indazol-3-one MLS000549352 cid_387161
Type:
Small organic molecule
Emp. Form.:
C12H14N4O2
Mol. Mass.:
246.2652
SMILES:
Cc1cc(=O)[nH]c(n1)-n1[nH]c2CCCCc2c1=O
: