Target
Intestinal-type alkaline phosphatase
Ligand
BDBM62366
Substrate
Meas. Tech.
Dose Response concentration confirmation of uHTS hits from a small molecule activators of human intestinal alkaline phosphatase via a luminescent assay
EC50
13400±n/a nM
Citation
 PubChem, PC Dose Response concentration confirmation of uHTS hits from a small molecule activators of human intestinal alkaline phosphatase via a luminescent assay PubChem Bioassay (2010)[AID] 
Target
Name:
Intestinal-type alkaline phosphatase
Synonyms:
ALPI Intestinal alkaline phosphatase | PPBI_HUMAN
Type:
PROTEIN
Mol. Mass.:
56804.94
Organism:
Homo sapiens (Human)
Description:
ChEMBL_1278525
Residue:
528
  
Inhibitor
Name:
BDBM62366
Synonyms:
2-[(4-bromo-2-methyl-phenyl)thio]acetic acid [3-cyano-3-(1,3-dihydrobenzimidazol-2-ylidene)-2-keto-propyl] ester MLS-0392851.0001 [3-cyano-3-(1,3-dihydrobenzimidazol-2-ylidene)-2-oxopropyl] 2-(4-bromo-2-methylphenyl)sulfanylacetate | cid_5679900
Type:
Small organic molecule
Emp. Form.:
C20H16BrN3O3S
Mol. Mass.:
458.328
SMILES:
Cc1cc(Br)ccc1SCC(=O)OCC(=O)C(C#N)c1nc2ccccc2[nH]1
: